ELECTION,OFFICECD,CANDID,CANCLASS,CANDLAST,CANDFIRST,CANDMI,COMMITTEE,FILING,SCHEDULE,PAGENO,SEQUENCENO,REFNO,DATE,REFUNDDATE,NAME,C_CODE,STRNO,STRNAME,APARTMENT,BOROUGHCD,CITY,STATE,ZIP,OCCUPATION,EMPNAME,EMPSTRNO,EMPSTRNAME,EMPCITY,EMPSTATE,AMNT,MATCHAMNT,PREVAMNT,PAY_METHOD,INTERMNO,INTERMNAME,INTSTRNO,INTSTRNM,INTAPTNO,INTCITY,INTST,INTZIP,INTEMPNAME,INTEMPSTNO,INTEMPSTNM,INTEMPCITY,INTEMPST,INTOCCUPA,PURPOSECD,EXEMPTCD,ADJTYPECD,RR_IND,SEG_IND,INT_C_CODE,,,,,,,,,,
2003,5,AI,P,"Ruiz, Jr.",Israel,,I,6,ABC,,,R0001070,8/10/2003 0:00,,")'GORMAN, DAISY",IND,,,,Q,QUEENS,NY,11363,ADMINISTRATOR,NYC DEPARTMENT OF EDUCATION,,PS 274,BROOKLYN,NY,250,250,0,2,,,,,,,,,,,,,,,,,,N,N,,,,,,,,,,,
2003,5,283,P,Gennaro,James,F,I,4,ABC,,,R0001407,5/15/2003 0:00,,108 Central Associates LLC,LLC,11,Horseshoe Lane,,Z,Great Neck,NY,11020,,,,,,,75,0,0,2,,,,,,,,,,,,,,,,,,N,N,,,,,,,,,,,
2003,5,444,P,Dilan,Erik,M,I,4,ABC,,,R0000454,3/6/2003 0:00,,"108 Central Associates, LLC",LLC,11,Horseshoe Lane,,Z,Great Neck,NY,11020,,,,,,,150,0,0,2,,,,,,,,,,,,,,,,,,N,N,,,,,,,,,,,
2003,5,527,P,Fidler,Lewis,A,I,4,ABC,,,R0001114,6/28/2003 0:00,,"11 ST MARKS ASSOCIATES, LLC",LLC,55,MAPLE AVE,504,Z,ROCKVILLE CENTR,NY,11570,,,,,,,270,0,0,2,,,,,,,,,,,,,,,,,,N,N,,,,,,,,,,,
2003,5,420,P,Comrie,Leroy,G,J,7,ABC,,,R0002388,9/8/2003 0:00,,114th. Block Association,OTHR,194-14,Murdock Avenue,,Q,Queens,NY,11412,,,,,,,50,0,0,5,,,,,,,,,,,,,,,,,,N,N,,,,,,,,,,,
2003,5,591,P,Baez,Maria,,I,4,ABC,,,R0000922,5/16/2003 0:00,,1170 WEBSTER AVE. CO.,LLC,44,OVERHILL RD.,,Z,NEW ROCHELLE,NY,10804,,,,,,,250,0,0,2,,,,,,,,,,,,,,,,,,N,N,,,,,,,,,,,
2003,5,711,P,Gonzalez,Sara,M,J,5,ABC,,,R0000556,7/14/2003 0:00,,1199 POLITICAL ACTION FUNDS,PCOMP,310,WESTN 43RD STREET,,M,NEW YORK,NY,10036,,,,,,,1500,0,0,2,,,,,,,,,,,,,,,,,,N,N,,,,,,,,,,,
2003,5,511,P,Clarke,Yvette,D,K,5,ABC,,,R0000833,4/11/2003 0:00,,1199 SEIU,PCOMP,310,Westn 43rd Street,,M,New York,NY,10036,,,,,,,1000,0,0,2,,,,,,,,,,,,,,,,,,N,N,,,,,,,,,,,
2003,5,Y2,P,Miller,A. Gifford,,I,4,ABC,,,R0000641,7/11/2003 0:00,,1199 SEIU,PCOMP,310,West 43rd Street,,M,New York,NY,10036,,,,,,,1500,0,0,2,,,,,,,,,,,,,,,,,,N,N,,,,,,,,,,,
2003,5,420,P,Comrie,Leroy,G,J,4,ABC,,,R0001551,6/27/2003 0:00,,1199 SEIU,PCOMP,310,WEST 43RD. STREET,,M,New York,NY,10036,,,,,,,1500,0,0,2,,,,,,,,,,,,,,,,,,N,N,,,,,,,,,,,
2003,5,762,P,Reddick,Yvonne,,H,6,ABC,,,R0000527,8/7/2003 0:00,,1199 SEIU,PCOMP,310,WESTN 43RD STREET,,M,NEW YORK,NY,10036,,,,,,,2750,0,0,2,,,,,,,,,,,,,,,,,,N,N,,,,,,,,,,,
2003,5,511,P,Clarke,Yvette,D,K,6,ABC,,,R0000877,8/18/2003 0:00,,1199 SEIU,PCOMP,310,Westn 43rd Street,,M,New York,NY,10036,,,,,,,1750,0,1000,2,,,,,,,,,,,,,,,,,,N,N,,,,,,,,,,,
2003,5,717,P,Gentile,Vincent,J,J,7,ABC,,,R0000726,8/4/2003 0:00,,1199 SEIU,PCOMP,310,WEST 43RD STREET,,M,NEW YORK,NY,10036,,,,,,,1000,0,0,2,,,,,,,,,,,,,,,,,,N,N,,,,,,,,,,,
2003,5,717,P,Gentile,Vincent,J,J,9,ABC,,,R0001113,10/18/2003 0:00,,1199 SEIU,PCOMP,310,WEST 43RD STREET,,M,NEW YORK,NY,10036,,,,,,,1750,0,1000,2,,,,,,,,,,,,,,,,,,N,N,,,,,,,,,,,
2003,5,361,P,Rivera,Joel,,J,11,ABC,,,R0001610,10/30/2003 0:00,,1199 SEIU,PCOMP,310,WEST 43RD ST,,M,NEW YORK,NY,10036,,,,,,,2750,0,0,2,,,,,,,,,,,,,,,,,,N,N,,,,,,,,,,,
2003,5,444,P,Dilan,Erik,M,I,7,ABC,,,R0001111,8/27/2003 0:00,,1199 SEIU,EMPO,310,WESTN 43RD STREET,,M,New York,NY,10036,,,,,,,2750,0,0,2,,,,,,,,,,,,,,,,,,N,N,,,,,,,,,,,
2003,5,399,P,Brewer,Gale,A,J,4,ABC,,,R0000955,5/29/2003 0:00,,1199 SEIU  POL. ACTION FUND,PCOMP,310,WEST 43 RD STREET,,M,NEW YORK,NY,10036,,,,,,,1500,0,0,2,,,,,,,,,,,,,,,,,,N,N,,,,,,,,,,,
2003,5,223,P,Martinez,Miguel,,I,4,ABC,,,R0001170,6/19/2003 0:00,,1199 SEIU NY STATE,PCOMP,310,WEST 43RD STREET,,M,NEW YORK,NY,10036,,,,,,,2750,0,0,2,,,,,,,,,,,,,,,,,,N,N,,,,,,,,,,,
2003,5,G9,P,Seabrook,Larry,B,J,6,ABC,,,R0000996,8/8/2003 0:00,,1199 SEIU NYS PAC FUND,PCOMP,310,WEST 43RD ST,,,NEW YORK,NY,10036,,,,,,,1500,0,0,2,,,,,,,,,,,,,,,,,,N,N,,,,,,,,,,,
2003,5,G9,P,Seabrook,Larry,B,J,10,ABC,,,R0001367,10/31/2003 0:00,,1199 SEIU NYS PAC FUND,PCOMP,310,WEST 43RD ST,,M,NEW YORK,NY,10036,,,,,,,1250,0,1500,2,,,,,,,,,,,,,,,,,,N,N,,,,,,,,,,,
2003,5,204,P,Quinn,Christine,C,J,4,ABC,,,R0000751,6/17/2003 0:00,,1199 SEIU PAC,PCOMP,310,WEST 43RD STREET,,M,NEW YORK,NY,10036,,,,,,,2750,0,0,2,,,,,,,,,,,,,,,,,,N,N,,,,,,,,,,,
2003,5,767,P,Palma,Annabel,,H,4,ABC,,,R0000101,6/18/2003 0:00,,1199 SEIU POL ACTION FUNDS,PCOMP,310,WEST 43RD STREET,,M,New York,NY,10036,,,,,,,2750,0,0,2,2,"CUNNINGHAM, JENNIFER",,,,New York,NY,10025,SEIU NYS COUNCIL,330,WEST 42ND STREET,New York,NY,EXECUTIVE DIRECTOR,,,,N,N,IND,,,,,,,,,,
2003,5,264,P,Katz,Melinda,R,L,4,ABC,,,R0001645,6/1/2003 0:00,,1199 SEIU POLITICAL ACTION FND,PCOMP,310,WEST 43RD STREET,,M,NEW YORK,NY,10036,,,,,,,1500,0,1000,2,,,,,,,,,,,,,,,,,,N,N,,,,,,,,,,,
2003,5,264,P,Katz,Melinda,R,L,1,ABC,,,R0000781,7/8/2002 0:00,,1199 SEIU POLITICAL ACTION FND,PCOMP,310,WEST 43RD STREET,,M,NEW YORK,NY,10036,,,,,,,1000,0,0,2,,,,,,,,,,,,,,,,,,N,N,,,,,,,,,,,
2003,5,271,P,McMahon,Michael,E,J,8,ABC,,,R0002552,7/20/2003 0:00,,1199 SEIU POLITICAL ACTION FUN,PCOMP,310,WEST 43RD STREET,,M,NEW YORK,NY,10036,,,,,,,2750,0,0,2,,,,,,,,,,,,,,,,,,N,N,,,,,,,,,,,
2003,5,272,P,Monserrate,Hiram,,J,8,ABC,,,R0001805,9/18/2003 0:00,,1199 SEIU POLITICAL ACTION FUN,PCOMP,310,WEST 43RD STREET,,M,NEW YORK,NY,10036,,,,,,,2750,0,0,2,,,,,,,,,,,,,,,,,,N,N,,,,,,,,,,,
2003,5,D2,P,Perkins,Bill,,J,10,ABC,,,R0001512,10/31/2003 0:00,,1199 SEIU POLITICAL ACTION FUN,PCOMP,310,W. 43RD ST.,,M,NEW YORK,NY,10036,,,,,,,2750,0,0,2,,,,,,,,,,,,,,,,,,N,N,,,,,,,,,,,
2003,5,591,P,Baez,Maria,,I,4,ABC,,,R0001201,6/17/2003 0:00,,1199/SEIU NEW YORK STATE,PCOMP,310,WEST 43RD STREET,,M,NEW YORK,NY,10036,,,,,,,2750,0,0,2,,,,,,,,,,,,,,,,,,N,N,,,,,,,,,,,
2003,5,326,P,de Blasio,Bill,,J,2,ABC,,,R0000679,8/12/2002 0:00,,1199/SEIU NEW YORK STATE  PAC,PCOMP,310,WEST 43RD STREET,,M,NEW YORK,NY,10036,,,,,,,1500,0,0,2,,,,,,,,,,,,,,,,,,N,N,,,,,,,,,,,
2003,5,326,P,de Blasio,Bill,,J,2,ABC,,,R0001168,1/10/2003 0:00,,1199/SEIU NEW YORK STATE  PAC,PCOMP,310,WEST 43RD STREET,,M,NEW YORK,NY,10036,,,,,,,1250,0,1500,2,,,,,,,,,,,,,,,,,,N,N,,,,,,,,,,,
2003,5,283,P,Gennaro,James,F,I,4,ABC,,,R0001417,5/17/2003 0:00,,1199/SEIU NYS PAC,PCOMP,310,W 43RD STREET,,M,NEW YORK,NY,10038,,,,,,,1000,0,0,2,,,,,,,,,,,,,,,,,,N,N,,,,,,,,,,,
2003,5,484,P,Jackson,Robert,,H,6,ABC,,,R0001031,8/8/2003 0:00,,1199/SEIU NYS POL ACTION FUND,PCOMP,310,W 43RD ST,,M,NEW YORK,NY,10036,,,,,,,1250,0,1500,2,,,,,,,,,,,,,,,,,,N,N,,,,,,,,,,,
2003,5,484,P,Jackson,Robert,,H,5,ABC,,,R0000980,7/25/2003 0:00,,1199/SEIU NYS POL ACTION FUND,PCOMP,310,W 43RD ST,,M,NEW YORK,NY,10036,,,,,,,1500,0,0,2,,,,,,,,,,,,,,,,,,N,N,,,,,,,,,,,
2003,5,480,P,James,Letitia,,I,10,ABC,,,R0001449,10/22/2003 0:00,,1199/SEIU NYS POLITICAL ACTION,PCOMP,310,WEST 43RD STREET,,M,NEW YORK,NY,10036,,,,,,,2750,0,0,2,,,,,,,,,,,,,,,,,,N,N,,,,,,,,,,,
2003,5,353,P,Rodriguez,Ydanis,A,I,11,ABC,,,R0002001,9/16/2003 0:00,,1345 Cleaning Service Co. L.P.,LLC,299,Park Avenue,,M,New York,NY,10171,,,,,,,2500,0,0,2,,,,,,,,,,,,,,,,,,N,N,,,,,,,,,,,
2003,5,758,P,Russo,Pasqualino,,H,10,ABC,,,R0001185,10/28/2003 0:00,,14 APOLLO ASSOCIATES,OTHR,480,76TH STREET,,K,Brooklyn,NY,11209,,,,,,,300,0,0,2,,,,,,,,,,,,,,,,,,N,N,,,,,,,,,,,
2003,5,767,P,Palma,Annabel,,H,11,ABC,,,R0002084,12/5/2003 0:00,,"1420 REALTY, L.L.C.",LLC,1919,WILLIAMSBRIDGE ROAD,,X,Bronx,NY,10461,,,,,,,250,0,0,2,,,,,,,,,,,,,,,,,,N,N,,,,,,,,,,,
2003,5,SH,P,Sears,Helen,,K,4,ABC,,,R0001284,6/17/2003 0:00,,150-9 ST NICHOLAS ASSOC,OTHR,1,W RED OAK LN,,Z,WHITE PLAINS,NY,10604,,,,,,,250,0,0,2,,,,,,,,,,,,,,,,,,N,N,,,,,,,,,,,
2003,5,CP,P,Stewart,Kendall,B,J,5,M,,,R0000442,6/6/2003 0:00,7/25/2003 0:00,1509 ST NICHOLAS ASSOCIATES,LLC,1,WEST RED OAK LANE,,Z,WHITE PLAINS,NY,10604,,,,,,,-250,0,0,0,,,,,,,,,,,,,,,,,2,N,N,,,,,,,,,,,
2003,5,CP,P,Stewart,Kendall,B,J,4,ABC,,,R0000226,6/6/2003 0:00,,1509 ST NICHOLAS ASSOCIATES,LLC,1,WEST RED OAK LANE,,Z,WHITE PLAINS,NY,10604,,,,,,,250,0,0,2,,,,,,,,,,,,,,,,,,N,N,,,,,,,,,,,
2003,5,334,P,Gallagher,Dennis,P,I,4,ABC,,,R0001661,6/3/2003 0:00,,1509 ST. NICHOLAS ASSOC (2104),LLC,ONE,WEST RED OAK LANE,,Z,WHITE PLAINS,NY,10604,,,,,,,250,0,0,2,1,"RICCI, FRANK",,,,NEW YORK,NY,10023,RENT STABILIZATION BOARD,123,WILLIAMS STREET,NEW YORK,NY,DIRECTOR GOVERNMENT AFFAIRS,,,,N,N,IND,,,,,,,,,,
2003,5,214,P,Oddo,James,S,L,4,ABC,,,R0000774,7/3/2003 0:00,,1509 ST. NICHOLAS ASSOC.,LLC,1,WEST RED OAK LANE,,Z,WHITE PLAINS,NY,10604,,,,,,,250,0,0,2,113,"RICCI, FRANK",,,,NEW YORK,NY,10023,RENT STABILIZATION ASSOCIATION,123,WILLIAM STREET,NEW YORK,NY,DIR. OF GOVT. AFFAIRS,,,,N,N,IND,,,,,,,,,,
2003,5,214,P,Oddo,James,S,L,8,M,,,R0000963,7/3/2003 0:00,9/16/2003 0:00,1509 ST. NICHOLAS ASSOC.,LLC,1,WEST RED OAK LANE,,Z,WHITE PLAINS,NY,10604,,,,,,,-250,0,0,0,,,,,,,,,,,,,,,,,2,N,N,,,,,,,,,,,
2003,5,283,P,Gennaro,James,F,I,4,ABC,,,R0001617,6/11/2003 0:00,,1509 St. Nicholas Associates,LLC,One,West Red Oak Lane,,Z,White Plains,NY,10604,,,,,,,250,0,0,2,,,,,,,,,,,,,,,,,,N,N,,,,,,,,,,,
2003,5,444,P,Dilan,Erik,M,I,4,ABC,,,R0000647,5/23/2003 0:00,,1509 St. Nicholas Associates,LLC,One,West Red Oak Lane,,Z,White Plain,NY,10604,,,,,,,250,0,0,2,1,"Ricci, Frank",,,,,,,RSA,123,Williams Street,New York,NY,,,,,N,N,IND,,,,,,,,,,
2003,5,527,P,Fidler,Lewis,A,I,4,ABC,,,R0001023,6/6/2003 0:00,,1509 STNICHOLAS ASSOC./METRO..,LLC,ONE,WEST RED OAK LANE,,Z,WHITE PLAINS,NY,10604,,,,,,,250,0,0,2,,,,,,,,,,,,,,,,,,N,N,,,,,,,,,,,
2003,5,223,P,Martinez,Miguel,,I,5,ABC,,,R0001515,7/30/2003 0:00,,1560-S LLC,LLC,1560,GRAND CONCOURSE,,X,BRONX,NY,,,,,,,,250,0,0,2,,,,,,,,,,,,,,,,,,N,N,,,,,,,,,,,
2003,5,591,P,Baez,Maria,,I,9,M,,,R0001863,5/15/2003 0:00,10/8/2003 0:00,1654 3RD AVE. LLC,LLC,2652,MAPLE AVE.,,Z,SEAFORD,NY,11783,,,,,,,-250,0,0,0,,,,,,,,,,,,,,,,,2,N,N,,,,,,,,,,,
2003,5,591,P,Baez,Maria,,I,4,ABC,,,R0001273,5/15/2003 0:00,,1654 3RD AVE. LLC,LLC,2652,MAPLE AVE.,,Z,SEAFORD,NY,11783,,,,,,,250,0,0,2,,,,,,,,,,,,,,,,,,N,N,,,,,,,,,,,
2003,5,361,P,Rivera,Joel,,J,4,ABC,,,R0000126,6/3/2003 0:00,,"1820  Harrison Realty, LLC",LLC,1919,Williamsbridge Road,,X,Bronx,NY,10461,,,,,,,125,0,0,2,102,"Perez II, Radame",,,,Bronx,NY,10469,"Mastermind Management, LTD",668,Crescent Ave.,Bronx,NY,Executive Vice President,,,,N,N,IND,,,,,,,,,,
2003,5,480,P,James,Letitia,,I,9,ABC,,,R0001380,10/17/2003 0:00,,18TH FRIENDS OF SEN MONTGOMERY,PCOMP,195,WILLOUGHBY AVENUE,,K,BROOKLYN,NY,11205,,,,,,,1000,0,0,2,,,,,,,,,,,,,,,,,,N,N,,,,,,,,,,,
2003,5,223,P,Martinez,Miguel,,I,2,ABC,,,R0000605,11/18/2002 0:00,,1956 Jerome Avenue LLC,LLC,1956,Jerome Avenue,,X,Bronx,NY,10467,,,,,,,250,0,0,2,,,,,,,,,,,,,,,,,,N,N,,,,,,,,,,,
2003,5,326,P,de Blasio,Bill,,J,4,ABC,,,R0002504,6/26/2003 0:00,,1995 Lillian Heller Revocable,OTHR,65,East 76th Street,,M,New York,NY,10021,,,,,,,250,0,0,2,,,,,,,,,,,,,,,,,,N,N,,,,,,,,,,,
2003,5,326,P,de Blasio,Bill,,J,10,ABC,,,R0003483,10/22/2003 0:00,,1995 LILLIAN HELLER REVOCABLE,OTHR,65,EAST 76TH STREET,,M,NEW YORK,NY,10021,,,,,,,250,0,250,2,9,"HELLER, FREDERIC",,,,PLEASANTVILLE,NY,10570,TEAM SYSTEMS,30-17,40TH AVENUE,QUEENS,NY,TAXI FLEET OWNER,,,,N,N,IND,,,,,,,,,,
2003,5,444,P,Dilan,Erik,M,I,4,ABC,,,R0000452,3/6/2003 0:00,,2265 LLC,PART,ONE,WEST RED OAK LANE,,Z,WHITE PLAINS,NY,10604,,,,,,,500,0,0,2,,,,,,,,,,,,,,,,,,N,N,,,,,,,,,,,
2003,5,484,P,Jackson,Robert,,H,11,ABC,,,R0001686,12/17/2003 0:00,,250 LIGHT STREET LLC,LLC,2250,LIGHT STREET,,X,BRONX,NY,10466,,,,,,,300,0,0,2,1,"ANELANTE, FRANK",,,,,,,,,,,,,,,,N,N,IND,,,,,,,,,,
2003,5,214,P,Oddo,James,S,L,4,ABC,,,R0000768,7/3/2002 0:00,,2505 OLINVILLE LLC,LLC,111,BROOK STREET,,Z,SCARSDALE,NY,10583,,,,,,,75,0,0,2,113,"RICCI, FRANK",,,,NEW YORK,NY,10023,RENT STABILIZATION ASSOCIATION,123,WILLIAM STREET,NEW YORK,NY,DIR. OF GOVT. AFFAIRS,,,,N,N,IND,,,,,,,,,,
2003,5,DD,P,Barron,Charles,,J,7,ABC,,,R0001215,8/26/2003 0:00,,32BJ,EMPO,101,AVENUE OF THE AMERICAS,,M,NEW YORK,NY,10013,,,,,,,500,0,0,2,,,,,,,,,,,,,,,,,,N,N,,,,,,,,,,,
2003,5,418,P,Gioia,Eric,,H,4,M,,,R0001993,1/10/2003 0:00,5/14/2003 0:00,3500 48th St. Associates,PART,417,Fifth Avenue,,M,New York,NY,10016,,,,,,,-500,0,0,0,,,,,,,,,,,,,,,,,1,N,N,,,,,,,,,,,
2003,5,418,P,Gioia,Eric,,H,4,M,,,R0001992,12/12/2002 0:00,5/14/2003 0:00,3500 48th St. Associates,PART,417,Fifth Avenue,,M,New York,NY,10016,,,,,,,-500,0,0,0,,,,,,,,,,,,,,,,,1,N,N,,,,,,,,,,,
2003,5,418,P,Gioia,Eric,,H,4,ABC,,,R0003268,7/10/2003 0:00,,3500 48th St. Associates,PART,417,Fifth Avenue,,M,New York,NY,10016,,,,,,,500,0,1250,2,,,,,,,,,,,,,,,,,,N,N,,,,,,,,,,,
2003,5,418,P,Gioia,Eric,,H,4,ABC,,,R0003269,7/10/2003 0:00,,3500 48th St. Associates,PART,417,Fifth Avenue,,M,New York,NY,10016,,,,,,,500,0,1250,2,,,,,,,,,,,,,,,,,,N,N,,,,,,,,,,,
2003,5,418,P,Gioia,Eric,,H,4,ABC,,,R0003186,5/29/2003 0:00,,3500 48th St. Associates,PART,417,Fifth Avenue,,M,New York,NY,10016,,,,,,,250,0,1000,2,,,,,,,,,,,,,,,,,,N,N,,,,,,,,,,,
2003,5,418,P,Gioia,Eric,,H,2,ABC,,,R0001979,12/12/2002 0:00,,3500 48th St. Associates,PART,417,Fifth Avenue,,M,New York,NY,10016,,,,,,,500,0,0,2,,,,,,,,,,,,,,,,,,N,N,,,,,,,,,,,
2003,5,418,P,Gioia,Eric,,H,2,ABC,,,R0001980,1/10/2003 0:00,,3500 48th St. Associates,PART,417,Fifth Avenue,,M,New York,NY,10016,,,,,,,500,0,500,2,,,,,,,,,,,,,,,,,,N,N,,,,,,,,,,,
2003,5,223,P,Martinez,Miguel,,I,4,ABC,,,R0001116,5/19/2003 0:00,,"39-08 103RD STREET, LLC",LLC,2495,SEVENTH AVE.,,M,New York,NY,10030,,,,,,,500,0,0,2,,,,,,,,,,,,,,,,,,N,N,,,,,,,,,,,
2003,5,223,P,Martinez,Miguel,,I,4,ABC,,,R0001117,5/19/2003 0:00,,"39-08 103RD STREET, LLC",LLC,2495,SEVENTH AVE.,,M,New York,NY,10030,,,,,,,500,0,0,2,,,,,,,,,,,,,,,,,,N,N,,,,,,,,,,,
2003,5,313,P,Felder,Simcha,,J,11,M,,,R0001077,6/6/2002 0:00,7/11/2003 0:00,405 Bedford Ave. Development,OTHR,236,Broadway,,K,Brooklyn,NY,11211,,,,,,,-750,0,0,0,,,,,,,,,,,,,,,,,2,N,N,,,,,,,,,,,
2003,5,313,P,Felder,Simcha,,J,1,ABC,,,R0000235,6/6/2002 0:00,,405 Bedford Ave. Development,OTHR,236,Broadway,,K,Brooklyn,NY,11211,,,,,,,750,0,0,2,,,,,,,,,,,,,,,,,,N,N,,,,,,,,,,,
2003,5,361,P,Rivera,Joel,,J,10,ABC,,,R0001126,11/3/2003 0:00,,504 Democratic Club,PCOMZ,63-74,Austin Street,2 E,Q,Queens,NY,11374,,,,,,,250,0,0,2,,,,,,,,,,,,,,,,,,N,N,,,,,,,,,,,
2003,5,280,P,Yassky,David,,J,2,ABC,,,R0001118,12/29/2002 0:00,,535 MANAGEMENT COMPANY,LLC,1,SIDNEY PLACE,,K,BROOKLYN,NY,11201,,,,,,,100,0,0,2,,,,,,,,,,,,,,,,,,N,N,,,,,,,,,,,
2003,5,444,P,Dilan,Erik,M,I,4,ABC,,,R0000654,5/23/2003 0:00,,55 E. Mosholu Pkwy LLC,LLC,1601,Bronxdale Avenue,,X,Bronx,NY,10462,,,,,,,400,0,0,2,1,"Ricci, Frank",,,,,,,RSA,123,Williams Street,New York,NY,,,,,N,N,IND,,,,,,,,,,
2003,5,444,P,Dilan,Erik,M,I,6,M,,,R0001067,5/23/2003 0:00,8/14/2003 0:00,55 E. Mosholu Pkwy LLC,LLC,1601,Bronxdale Avenue,,X,Bronx,NY,10462,,,,,,,-400,0,0,0,,,,,,,,,,,,,,,,,5,N,N,,,,,,,,,,,
2003,5,283,P,Gennaro,James,F,I,4,ABC,,,R0001405,5/15/2003 0:00,,"669 Bushwick Associates, LLC",LLC,11,Horseshoe Lane,,Z,Great Neck,NY,11020,,,,,,,75,0,0,2,,,,,,,,,,,,,,,,,,N,N,,,,,,,,,,,
2003,5,223,P,Martinez,Miguel,,I,7,ABC,,,R0001746,9/9/2003 0:00,,860-870 REALTY LLC,LLC,2207,CONEY ISLAND AVENUE,,K,Brooklyn,NY,11223,,,,,,,1000,0,0,2,,,,,,,,,,,,,,,,,,N,N,,,,,,,,,,,
2003,5,214,P,Oddo,James,S,L,4,ABC,,,R0000761,7/3/2003 0:00,,93 CLINTON LLC,LLC,55,MAPLE AVENUE,504,Z,ROCKVILLE CTR.,NY,11570,,,,,,,270,0,0,2,113,"RICCI, FRANK",,,,NEW YORK,NY,10023,RENT STABILIZATION ASSOCIATION,123,WILLIAM STREET,NEW YORK,NY,DIR. OF GOVT. AFFAIRS,,,,N,N,IND,,,,,,,,,,
2003,5,264,P,Katz,Melinda,R,L,1,ABC,,,R0000770,6/25/2002 0:00,,"98-22 REALTY, LLC",PART,1060,FARMINGDALE ROAD,,Z,NORTH LINDENHUR,NY,11757,,,,,,,250,0,0,2,,,,,,,,,,,,,,,,,,N,N,,,,,,,,,,,
2003,5,758,P,Russo,Pasqualino,,H,9,ABC,,,R0000903,10/2/2003 0:00,,a a valet,OTHR,190,east 72nd street,,M,New York,NY,10021,,,,,,,100,0,0,2,,,,,,,,,,,,,,,,,,N,N,,,,,,,,,,,
2003,5,420,P,Comrie,Leroy,G,J,4,ABC,,,R0001562,6/27/2003 0:00,,"A CUOMO FOR GOVERNOR, INC",PCOMP,,,,,,,,,,,,,,500,0,0,2,,,,,,,,,,,,,,,,,,N,N,,,,,,,,,,,
2003,5,232,P,Weprin,David,I,H,4,ABC,,,R0001520,3/26/2003 0:00,,A.J.S. TRANSPORTS,OTHR,41-40,149TH ST,,Q,FLUSHING,NY,11355,,,,,,,150,0,0,2,,,,,,,,,,,,,,,,,,N,N,,,,,,,,,,,
2003,5,546,P,Lanza,Andrew,J,I,4,ABC,,,R0000265,5/10/2003 0:00,,A.T.U. #726,PCOMP,,P.O. BOX 131466,,S,STATEN ISLAND,NY,10313,,,,,,,110,0,0,2,,,,,,,,,,,,,,,,,,N,N,,,,,,,,,,,
2003,5,283,P,Gennaro,James,F,I,6,ABC,,,R0002146,8/14/2003 0:00,,"Aal, Thomas",IND,,,,Q,Queens,NY,11366,,,,,,,25,25,0,2,,,,,,,,,,,,,,,,,,N,N,,,,,,,,,,,
2003,5,TH,P,Fisher,Florence,,H,6,ABC,,,R0000845,8/12/2003 0:00,,"AAL, THOMAS H",IND,,,,Q,QUEENS,NY,11366,RETIRED,,,,,,25,25,0,2,,,,,,,,,,,,,,,,,,N,N,,,,,,,,,,,
2003,5,232,P,Weprin,David,I,H,10,ABC,,,R0002292,11/3/2003 0:00,,"AARON, SHERRY",IND,,,,Q,QUEENS,NY,11364,ATTORNEY,NYCECB,144-06,94TH AVE,QUEENS,NY,250,0,0,2,,,,,,,,,,,,,,,,,,N,N,,,,,,,,,,,
2003,5,D2,P,Perkins,Bill,,J,4,ABC,,,R0000826,6/3/2003 0:00,,"AARONS, FAITH",IND,,,,M,NEW YORK,NY,10009,,,,,,,25,25,0,2,,,,,,,,,,,,,,,,,,N,N,,,,,,,,,,,
2003,5,733,P,Figueroa,Felix,,H,6,ABC,,,R0000728,8/1/2003 0:00,,"ABAD, MARY",IND,,,,X,BRONX,NY,10468,BUS DRIVER,AMBOY ATLANTIC EXPRESS,399,EXTERIOR ST.,BRONX,NY,65,65,0,1,,,,,,,,,,,,,,,,,,N,N,,,,,,,,,,,
2003,5,MJ,P,Martinez,Juan,D,I,4,ABC,,,R0000875,5/30/2003 0:00,,"Abadi, Sameera",IND,,,,K,Brooklyn,NY,11209,Teacher,New York City Dept. of Educ.,223,Graham Avenue,Brooklyn,NY,25,25,75,1,,,,,,,,,,,,,,,,,,N,N,,,,,,,,,,,
2003,5,MJ,P,Martinez,Juan,D,I,3,ABC,,,R0000278,12/5/2002 0:00,,"Abadi, Sameera",IND,,,,K,Brooklyn,NY,11209,Teacher,New York City Dept. of Educ.,223,Graham Avenue,Brooklyn,NY,75,75,0,2,,,,,,,,,,,,,,,,,,N,N,,,,,,,,,,,
2003,5,HB,P,Betancourt Jr,Ismael,,H,4,ABC,,,R0000178,7/10/2003 0:00,,"ABADIA, ENEIDA",IND,,,,X,Bronx,NY,10473,,HOMEMAKER,,,,,100,100,0,5,,,,,,,,,,,,,,,,,,N,N,,,,,,,,,,,
2003,5,326,P,de Blasio,Bill,,J,4,ABC,,,R0001966,5/20/2003 0:00,,"Abadinsky, Sandi H",IND,,,,Z,Columbia,MD,20036,Director of Public Relations,The Enterprise Foundation,10227,Wincopin Circle,Columbia,MD,100,0,0,2,,,,,,,,,,,,,,,,,,N,N,,,,,,,,,,,
2003,5,371,P,Reich,David,,H,6,ABC,,,R0000687,8/11/2003 0:00,,"ABAEV, ALEXANDER",IND,,,,Q,JAMAICA ESTATES,NY,11432,,,,,,,50,50,0,2,,,,,,,,,,,,,,,,,,N,N,,,,,,,,,,,
2003,5,418,P,Gioia,Eric,,H,2,ABC,,,R0001246,1/10/2003 0:00,,"Abate, Catherine",IND,,,,M,New York,NY,10003,President,Community Healthcare Network,184,Fifth Avenue,New York,NY,100,100,0,2,,,,,,,,,,,,,,,,,,N,N,,,,,,,,,,,
2003,5,Y2,P,Miller,A. Gifford,,I,8,ABC,,,R0000811,9/23/2003 0:00,,"ABATE, CATHERINE",IND,,,,M,NEW YORK,NY,10003,PRES/CEO,COMMUNITY HEALTHCARE NETWORK,79,MADISON AVE,NEW YORK,NY,150,150,0,2,,,,,,,,,,,,,,,,,,N,N,,,,,,,,,,,
2003,5,268,P,Gerson,Alan,J,I,5,ABC,,,R0001226,7/25/2003 0:00,,"ABATE, CATHERINE M",IND,,,,M,NEW YORK,NY,10003,PRESIDENT/CEO,CHN,79,MADISON AVENUE,NEW YORK,NY,75,0,0,2,,,,,,,,,,,,,,,,,,N,N,,,,,,,,,,,
2003,5,204,P,Quinn,Christine,C,J,10,ABC,,,R0001566,10/30/2003 0:00,,"ABATE, CATHERINE M",IND,,,,,,,,,,,,,,75,0,0,2,,,,,,,,,,,,,,,,,,N,N,,,,,,,,,,,
2003,5,452,P,Reyna,Diana,,H,4,ABC,,,R0000840,2/5/2003 0:00,,"Abate, Vincent",IND,,,,K,Brooklyn,NY,11211,Retired,,,,,,50,50,100,2,,,,,,,,,,,,,,,,,,N,N,,,,,,,,,,,
2003,5,452,P,Reyna,Diana,,H,4,ABC,,,R0000086,1/31/2003 0:00,,"Abate, Vincent",IND,,,,K,Brooklyn,NY,11211,Retired,,,,,,100,100,0,2,,,,,,,,,,,,,,,,,,N,N,,,,,,,,,,,
2003,5,280,P,Yassky,David,,J,2,ABC,,,R0001185,12/6/2002 0:00,,"ABATE, VINVENT",IND,,,,K,BROOKLYN,NY,11211,,RETIRED,,,,,100,100,0,2,,,,,,,,,,,,,,,,,,N,N,,,,,,,,,,,
2003,5,737,P,Mossa,Michael,,H,5,ABC,,,R0000092,7/31/2003 0:00,,"ABATEMARCO, GERALD",IND,,,,Q,HOWARD BEACH,NY,11414,RETIRED,RETIRED,,,,,200,200,0,2,,,,,,,,,,,,,,,,,,N,N,,,,,,,,,,,
2003,5,LW,P,Recchia,Domenic,M,I,2,ABC,,,R0000050,11/21/2002 0:00,,"ABBATE, ANTONIA",IND,,,,K,BROOKLYN,NY,11214,BAKER,SELF EMPLOYED,,,,,50,50,0,2,,,,,,,,,,,,,,,,,,N,N,,,,,,,,,,,
2003,5,TH,P,Fisher,Florence,,H,4,ABC,,,R0000607,4/16/2003 0:00,,"ABBATE, MARY A",IND,,,,Q,QUEENS,NY,11364,SOCIAL SERVICE ADMINISTRATOR,FOREST HILLS COMMUNITY HOUSE,108-25,62ND DRIVE,QUEENS,NY,100,100,0,2,,,,,,,,,,,,,,,,,,N,N,,,,,,,,,,,
2003,5,LW,P,Recchia,Domenic,M,I,2,ABC,,,R0000052,11/21/2002 0:00,,"ABBATE, PETER, JR.",IND,,,,K,BROOKLYN,NY,11228,ASSEMBLYMAN,NYS ASSEMBLY,8500,18TH AVENUE,BROOKLYN,NY,125,125,0,2,,,,,,,,,,,,,,,,,,N,N,,,,,,,,,,,
2003,5,D2,P,Perkins,Bill,,J,4,ABC,,,R0000933,6/25/2003 0:00,,"ABBOA-OFFEI, ABENAA E",IND,,,,Z,NEW ROCHELLE,NY,10801,PUBLIC AFFAIRS,AFFINITY HEALTH PLAN,1,EXECUTIVE BLVD,YONKERS,NY,100,0,0,2,,,,,,,,,,,,,,,,,,N,N,,,,,,,,,,,
2003,5,334,P,Gallagher,Dennis,P,I,10,ABC,,,R0001945,11/3/2003 0:00,,ABBOTT BUSHLOW POND,PART,70-11,FRESH POND RD,,Q,RIDGEWOOD,NY,11385,,,,,,,250,0,0,2,,,,,,,,,,,,,,,,,,N,N,,,,,,,,,,,
2003,5,487,P,Serrano,Jose,M,J,6,ABC,,,R0000812,8/11/2003 0:00,,"ABBOTT, ERIC",IND,,,,X,BRONX,NY,10461,MIS MANAGER,VIP COMMUNITY SERVICES,1910,ARTHUR AVENUE,BRONX,NY,10,10,0,1,11,"BUTTER, SANDRA",,,,YONKERS,NY,10710,VIP COMMUNITY SERVICES,1910,ARTHUR AVENUE,BRONX,NY,PRESIDENT,,,,N,N,IND,,,,,,,,,,
2003,5,762,P,Reddick,Yvonne,,H,6,ABC,,,R0000585,8/24/2003 0:00,,"ABBRACCIAMENTO, FRANCES",IND,,,,Q,QUEENS,NY,11697,,,,,,,25,25,0,2,,,,,,,,,,,,,,,,,,N,N,,,,,,,,,,,
2003,5,730,P,Rodriguez,Luana,M,H,4,ABC,,,R0000235,7/11/2003 0:00,,"Abbruzzese, Ursula",IND,,,,X,Bronx,NY,10458,retired,,,,,,100,100,0,2,,,,,,,,,,,,,,,,,,N,N,,,,,,,,,,,
2003,5,717,P,Gentile,Vincent,J,J,8,ABC,,,R0000950,9/26/2003 0:00,,"ABDALLAH, ELI",IND,,,,K,BROOKLYN,NY,11209,CIVIL ENGINEER,PARSONS BRINCKERHOFF,ONE,PENN PLAZA,NEW YORK,NY,50,50,100,2,,,,,,,,,,,,,,,,,,N,N,,,,,,,,,,,
2003,5,717,P,Gentile,Vincent,J,J,4,ABC,,,R0000480,6/18/2003 0:00,,"ABDALLAH, ELI",IND,,,,K,BROOKLYN,NY,11209,CIVIL ENGINEER,PARSONS BRINCKERHOFF,ONE,PENN PLAZA,NEW YORK,NY,100,100,0,2,,,,,,,,,,,,,,,,,,N,N,,,,,,,,,,,
2003,5,271,P,McMahon,Michael,E,J,4,ABC,,,R0002098,3/6/2003 0:00,,"ABDEL-JAWAD, MD, YOUSIF M",IND,,,,S,STATEN ISLAND,NY,10305,DOCTOR,STATEN ISLAND MEDICAL GROUP,1050,CLOVE ROAD,STATEN ISLAND,NY,100,100,0,2,,,,,,,,,,,,,,,,,,N,N,,,,,,,,,,,
2003,5,480,P,James,Letitia,,I,6,ABC,,,R0000813,8/25/2003 0:00,,"ABDELJAWAD, ABDELATIF",IND,,,,K,BROOKLYN,NY,11214,MANAGER,METFOOD SUPERMARKET,632,VANDERBILT AVENUE,BROOKLYN,NY,250,250,0,2,,,,,,,,,,,,,,,,,,N,N,,,,,,,,,,,
2003,5,271,P,McMahon,Michael,E,J,4,ABC,,,R0001716,3/6/2003 0:00,,"ABDUL-HALIM, ERMELL",IND,,,,S,STATEN ISLAND,NY,10304,,,,,,,25,25,0,2,,,,,,,,,,,,,,,,,,N,N,,,,,,,,,,,
2003,5,440,P,Mattera,Gloria,,I,7,ABC,,,R0000477,9/8/2003 0:00,,"ABDULAH, NORMA",IND,,,,M,NEW YORK,NY,10029,RETIRED TEACHER,,,,,,400,250,0,2,,,,,,,,,,,,,,,,,,N,N,,,,,,,,,,,
2003,5,DD,P,Barron,Charles,,J,2,ABC,,,R0000159,10/15/2002 0:00,,"ABDULLAH, KHADIJAH",IND,,,,K,BROOKLYN,NY,11207,CLERK,NYCHA,914,VAN SICLEN AVE,BROOKLYN,NY,40,40,0,1,,,,,,,,,,,,,,,,,,N,N,,,,,,,,,,,
2003,5,DD,P,Barron,Charles,,J,2,ABC,,,R0000174,10/19/2002 0:00,,"ABDULLAH, KHADIJAH",IND,,,,K,BROOKLYN,NY,11207,CLERK,NYCHA,914,VAN SICLEN AVE,BROOKLYN,NY,50,50,40,1,,,,,,,,,,,,,,,,,,N,N,,,,,,,,,,,
2003,5,ER,P,Jennings,Allan,W,I,4,ABC,,,R0000682,5/3/2003 0:00,,"ABDUM-RAHMAN, KEVIN",IND,,,,M,NEW YORK,NY,10027,ADMINISTRATOR,CITY COLLEGE OF NY,,138TH STREET & CONVENT AVE,NEW YORK,NY,20,20,0,1,,,,,,,,,,,,,,,,,,N,N,,,,,,,,,,,
2003,5,TH,P,Fisher,Florence,,H,6,ABC,,,R0000841,8/21/2003 0:00,,"ABEL, ADELE",IND,,,,Q,QUEENS,NY,11367,RETIRED,,,,,,20,20,15,2,,,,,,,,,,,,,,,,,,N,N,,,,,,,,,,,
2003,5,TH,P,Fisher,Florence,,H,4,ABC,,,R0000334,3/6/2003 0:00,,"ABEL, ADELE",IND,,,,Q,QUEENS,NY,11367,RETIRED,,,,,,15,15,0,2,,,,,,,,,,,,,,,,,,N,N,,,,,,,,,,,
2003,5,D7,P,Ragusa,Philip,,I,10,ABC,,,R0000955,10/23/2003 0:00,,"ABEL, MICHAEL J",IND,,,,Q,QUEENS,NY,11361,HPD DIRECTOR,NYC,100,GOLD ST.,NEW YORK,NY,70,70,120,2,,,,,,,,,,,,,,,,,,N,N,,,,,,,,,,,
2003,5,D7,P,Ragusa,Philip,,I,4,ABC,,,R0000424,6/5/2003 0:00,,"ABEL, MICHAEL J",IND,,,,Q,QUEENS,NY,11361,HPD DIRECTOR,NYC,100,GOLD ST.,NEW YORK,NY,120,120,0,2,,,,,,,,,,,,,,,,,,N,N,,,,,,,,,,,
2003,5,399,P,Brewer,Gale,A,J,9,ABC,,,R0001475,10/17/2003 0:00,,"ABELARDE, PATRICIA A",IND,,,,M,NEW YORK,NY,10023,CLERICAL,NYC DEPT. OF HEALTH,125,NORTH STREET,NEW YORK,NY,25,25,0,2,,,,,,,,,,,,,,,,,,N,N,,,,,,,,,,,